PrimaryVendor,PricingGroup,InternalPartNumber,PartNumber,Description,Cost,Retail,Jobber,CoreCharge,Map,Other,OtherName,EastStock,WestStock,Stock,MfrStock,MfrStockDate,DropShip,DSFee,Weight
Access,Access,accC100001,C100001,"Access Rockstar Roctection Universal (Fits Most P/Us & SUVs) 80in. Wide Hitch Mounted Mud Flaps",152.75,279.00,209.25,,,,,2,0,2,,,possible,"No Fee",27.00
Access,Access,accB1010049,B1010049,"Access LOMAX Tri-Fold Cover 17-19 Ford Super Duty F-250/F-350/F-450 - 6ft 8in Standard Bed",614.30,"1,122.00",841.50,,953.70,,,1,2,3,,,possible,"No Fee",74.00
Access,Access,accB1040029,B1040029,"Access LOMAX Tri-Fold Cover 02-19 Dodge Ram 6Ft./4in. Bed (w/o Rambox Cargo Management System)",614.30,"1,122.00",841.50,,953.70,,,2,0,4,,,possible,"No Fee",72.00
Access,Access,accB1010029,B1010029,"Access LOMAX Tri-Fold Cover 04-19 Ford F-150 - 6ft 6in Standard Bed",614.30,"1,122.00",841.50,,953.70,,,1,3,4,,,possible,"No Fee",73.00
Access,Access,acc13239,13239,"Access Original 2017 Titan XD 8ft Bed (Clamps On w/ or w/o Utili-Track) Roll-Up Cover",322.48,589.00,441.75,,500.65,,,1,2,3,,,possible,"No Fee",39.00
Access,Access,acc23239,23239,"Access Limited 17-19 Titan XD 8ft Bed (Clamps On w/ or w/o Utili-Track) Roll-Up Cover",360.26,658.00,493.50,,559.30,,,1,2,3,,,possible,"No Fee",42.00
Access,Access,acc33239,33239,"Access Literider 17 Titan XD 8ft Bed (Clamps On w/ or w/o Utili-Track) Roll-Up Cover",271.56,496.00,372.00,,,,,1,2,3,,,possible,"No Fee",38.00
Access,Access,acc43239,43239,"Access Lorado 17 Titan XD 8ft Bed (Clamps On w/ or w/o Utili-Track) Roll-Up Cover",322.48,589.00,441.75,,500.65,,,0,0,0,,,possible,"No Fee",41.00
Access,Access,acc22030239,22030239,"Access Tonnosport 17-19 Titan XD 8ft Bed (Clamps On w/ or w/o Utili-Track) Roll-Up Cover",231.59,423.00,317.25,,,,,0,1,1,,,possible,"No Fee",35.00
Access,Access,acc93239,93239,"Access Vanish 17 Titan XD 8ft Bed (Clamps On w/ or w/o Utili-Track) Roll-Up Cover",266.09,486.00,364.50,,,,,1,1,2,,,possible,"No Fee",35.00
Access,Access,acc25030239,25030239,"Access Truck Bed Mat Titan/Titan XD 8ft Bed",96.91,177.00,132.75,,,,,0,0,0,,,possible,"No Fee",7.00
Access,Access,acc80273,80273,"Access Replacement Quick Clip Storage Strap LITERIDER / TONNOSPORT Strap w/ Buckle & Tapping Screw",0.82,1.50,1.13,,,,,0,0,0,,,possible,"No Fee",0.25
Access,Access,acc20832,20832,"Access Slide Lock",2.28,4.16,3.12,,,,,0,0,0,,,possible,"No Fee",6.00
Access,Access,acc16039,16039,"Access Original 17-19 Honda Ridgeline 5ft Bed Roll-Up Cover",315.91,577.00,432.75,,490.45,,,1,0,1,,,possible,"No Fee",32.00
Access,Access,acc4000263,4000263,"Access Rockstar Anti-Rattle Clamp",8.18,14.95,11.21,,,,,0,0,0,,,possible,"No Fee",2.00
Access,Access,acc4000507,4000507,"Access Rockstar ALL Rubber Strips w Hardware (Set Of Two)",32.84,59.99,44.99,,,,,0,0,0,,,possible,"No Fee",9.00
Access,Access,acc90921,90921,"Access Rockstar ALL Accessories Extended Shaft - 2in & 2-5/16in Drop Ball Hitch for 2-1/2in Receiver",120.42,219.95,164.96,,,,,0,0,0,,,possible,"No Fee",38.00
Access,Access,acc90923,90923,"Access Rockstar ALL Accessories Extended Shaft - 2in & 2-5/16in Drop Ball Hitch for 2in Receiver",112.21,204.95,153.71,,,,,0,0,0,,,possible,"No Fee",31.80
Access,Access,acc46039,46039,"Access Lorado 17-19 Honda Ridgeline 5ft Bed Roll-Up Cover",315.91,577.00,432.75,,490.45,,,1,0,1,,,possible,"No Fee",31.00
Access,Access,acc10164,10164,"Access 1in Female End Side Squeeze Buckle",0.82,1.50,1.13,,,,,0,0,0,,,possible,"No Fee",0.25
Access,Access,acc4000570,4000570,"Access Rockstar Universal Splash Guard Mudflaps 12in Width / 24in Length",48.73,89.00,66.75,,,,,0,0,0,,,possible,"No Fee",11.10
Access,Access,accB1020049,B1020049,"Access LOMAX Tri-Fold Cover 15-19 Chevy Colorado/ 2015-19 GMC Canyon 6ft Bed",614.30,"1,122.00",841.50,,953.70,,,2,0,2,,,possible,"No Fee",64.00
Access,Access,acc20790,20790,"Access Replacement Hook Tape Kit 1-1/2in x 17ft w/ 4 Screws",15.33,28.00,21.00,,,,,0,0,0,,,possible,"No Fee",6.00
Access,Access,acc13229,13229,"Access Original 17-19 Nissan Titan 5-1/2ft Bed (Clamps On w/ or w/o Utili-Track) Roll-Up Cover",315.91,577.00,432.75,,490.45,,,1,0,1,,,possible,"No Fee",34.00
Access,Access,acc23229,23229,"Access Limited 17-19 NIssan Titan 5-1/2ft Bed (Clamps On w/ or w/o Utili-Track) Roll-Up Cover",354.78,648.00,486.00,,550.80,,,0,0,0,,,possible,"No Fee",38.00
Access,Access,acc43229,43229,"Access Lorado 17-19 Nissan Titan 5-1/2ft Bed (Clamps On w/ or w/o Utili-Track) Roll-Up Cover",315.91,577.00,432.75,,490.45,,,1,0,1,,,possible,"No Fee",34.00
Access,Access,acc33229,33229,"Access Literider 17-19 NIssan Titan 5-1/2ft Bed (Clamps On w/ or w/o Utili-Track) Roll-Up Cover",266.09,486.00,364.50,,,,,0,0,0,,,possible,"No Fee",35.00
Access,Access,acc93229,93229,"Access Vanish 17-19 NIssan Titan 5-1/2ft Bed (Clamps On w/ or w/o Utili-Track) Roll-Up Cover",260.06,475.00,356.25,,,,,0,0,0,,,possible,"No Fee",30.00
Access,Access,acc22030229,22030229,"Access Tonnosport 17-19 NIssan Titan 5-1/2ft Bed (Clamps On w/ or w/o Utili-Track) Roll-Up Cover",226.12,413.00,309.75,,,,,0,0,0,,,possible,"No Fee",31.00
Access,Access,acc27010369,27010369,"Access Tailgate Protector 15-17 Ford F150",94.17,172.00,129.00,,,,,0,0,0,,,possible,"No Fee",24.00
Access,Access,acc27010399,27010399,"Access Tailgate Protector 17-19 Ford F-250/F-350/F-450 Super Duty",94.17,172.00,129.00,,,,,1,0,1,,,possible,"No Fee",24.00
Access,Access,acc30474,30474,"Access Slide In Hook Replacement Kit 1-1/2in x 17 ft w/ 4 screws",20.26,37.00,27.75,,,,,0,0,0,,,possible,"No Fee",1.25
Access,Access,acc11409,11409,"Access Original 17-19 Ford Super Duty F-250/F-350/F-450 8ft Box (Including Dually) Roll Up Cover",322.48,589.00,441.75,,500.65,,,1,0,1,,,possible,"No Fee",36.00
Access,Access,acc21409,21409,"Access Limited 17-19 Ford Super Duty F-250/F-350/F-450 8ft Box (Includes Dually) Roll-Up Cover",360.26,658.00,493.50,,559.30,,,0,0,0,,,possible,"No Fee",38.00
Access,Access,acc31409,31409,"Access Literider 17-19 Ford Super Duty F-250/F-350/F-450 8ft Box (Includes Dually) Roll-Up Cover",271.56,496.00,372.00,,,,,0,0,0,,,possible,"No Fee",35.00
Access,Access,acc61409,61409,"Access Toolbox 17-19 Ford Super Duty F-250/F-350/F-450 8ft Box (Includes Dually) Roll-Up Cover",322.48,589.00,441.75,,500.65,,,0,0,0,,,possible,"No Fee",36.00
Access,Access,acc91409,91409,"Access Vanish 17-19 Ford Super Duty F-250/F-350/F-450 8ft Box (Includes Dually) Roll-Up Cover",266.09,486.00,364.50,,,,,0,0,0,,,possible,"No Fee",27.00
Access,Access,acc22010409,22010409,"Access Tonnosport 17-19 Ford Super Duty F-250/F-350/F-450 8ft Box (Includes Dually) Roll-Up Cover",231.59,423.00,317.25,,,,,0,0,0,,,possible,"No Fee",28.00
Access,Access,accB1050039,B1050039,"Access LOMAX Tri-Fold Cover 07-17 Toyota Tundra  - 5ft 6in Bed (w/o Deck Rail)",568.85,"1,039.00",779.25,,883.15,,,2,0,2,,,possible,"No Fee",66.00
Access,Access,accB1050049,B1050049,"Access LOMAX Tri-Fold Cover 07-17 Toyota Tundra  - 6ft 6in Bed (w/o Deck Rail)",614.30,"1,122.00",841.50,,953.70,,,2,0,2,,,possible,"No Fee",74.00
Access,Access,acc10160,10160,"Access Quick Release Storage Straps (2 Straps/Snap-On Brackets)",9.68,17.68,13.26,,,,,0,0,0,,,possible,"No Fee",1.00
Access,Access,accB1010039,B1010039,"Access LOMAX Tri-Fold Cover 08-16 Ford Super Duty F-250/F-350/F-450 - 6ft 8in Standard Bed",614.30,"1,122.00",841.50,,953.70,,,1,0,1,,,possible,"No Fee",75.00
Access,Access,acc4000944,4000944,"Access ADARAC Aluminum Pro Series 02-19 Dodge Ram 1500 6ft 4in Bed (w/o RamBox) Truck Rack",316.46,578.00,433.50,,,,,0,0,0,,,possible,"No Fee",48.00
Access,Access,acc4000945,4000945,"Access ADARAC Aluminum Pro Series 09+ Dodge Ram 1500 8ft Bed (w/o RamBox) Truck Rack",327.95,599.00,449.25,,,,,0,0,0,,,possible,"No Fee",33.00
Access,Access,acc4000946,4000946,"Access ADARAC Aluminum Pro Series 97+ Ford F-150 6ft 6in Bed Truck Rack",316.46,578.00,433.50,,,,,0,0,0,,,possible,"No Fee",28.00
Access,Access,acc4000947,4000947,"Access ADARAC Aluminum Pro Series 97+ Ford F-150 8ft Bed Truck Rack",327.95,599.00,449.25,,,,,0,0,0,,,possible,"No Fee",33.00
Access,Access,acc4000948,4000948,"Access ADARAC Aluminum Pro Series 14+ Chevy/GMC Full Size 1500 6ft 6in Bed Truck Rack",316.46,578.00,433.50,,,,,0,0,0,,,possible,"No Fee",28.00
Access,Access,acc4000949,4000949,"Access ADARAC Aluminum Pro Series 14+ Chevy/GMC Full Size 1500 8ft Bed Truck Rack",327.95,599.00,449.25,,,,,0,0,0,,,possible,"No Fee",33.00
Access,Access,acc4000950,4000950,"Access ADARAC Aluminum Pro Series 15-19 Chevy/GMC Colorado/Canyon 5ft Bed Truck Rack",316.46,578.00,433.50,,,,,0,0,0,,,possible,"No Fee",25.00
Access,Access,acc4000951,4000951,"Access ADARAC Aluminum Pro Series 15-19 Chevy/GMC Colorado/Canyon 6ft Bed Truck Rack",316.46,578.00,433.50,,,,,0,0,0,,,possible,"No Fee",27.00
Access,Access,acc4000952,4000952,"Access ADARAC Aluminum Pro Series 17-19 Ford Super Duty F-250/F-350 6ft 8in Truck Rack",316.46,578.00,433.50,,,,,0,0,0,,,possible,"No Fee",29.00
Access,Access,acc4000955,4000955,"Access ADARAC Aluminum Pro Series 08-16 Ford Super Duty F-250/F-350 6ft 8in Bed Truck Rack",316.46,578.00,433.50,,,,,0,0,0,,,possible,"No Fee",29.00
Access,Access,acc4000956,4000956,"Access ADARAC Aluminum Pro Series 03+ Dodge Ram 2500/3500 6ft 4in Bed (w/o RamBox) Truck Rack",316.46,578.00,433.50,,,,,0,0,0,,,possible,"No Fee",28.00
Access,Access,acc4000957,4000957,"Access ADARAC Aluminum Pro Series 10-19 Dodge Ram 2500/3500 8ft Bed (w/o RamBox) Truck Rack",327.95,599.00,449.25,,,,,0,0,0,,,possible,"No Fee",33.00
Access,Access,acc4000958,4000958,"Access ADARAC Aluminum Pro Series 17-19 Ford Super Duty F-250/F-350 (Incl Dually) 8ft Bed Truck Rack",327.95,599.00,449.25,,,,,0,0,0,,,possible,"No Fee",33.00
Access,Access,acc4000959,4000959,"Access ADARAC Aluminum Pro Series 15-19 Chevy/GMC 2500/3500 Full Size 6ft 6in Bed Truck Rack",316.46,578.00,433.50,,,,,0,0,0,,,possible,"No Fee",28.00
Access,Access,acc4000960,4000960,"Access ADARAC Aluminum Pro Series 15-19 Chevy/GMC 2500/3500 Full Size 8ft Bed Truck Rack",327.95,599.00,449.25,,,,,0,0,0,,,possible,"No Fee",33.00
Access,Access,acc4000963,4000963,"Access ADARAC Aluminum Pro Series 14+ Chevy/GMC Full Size 1500 5ft 8in Bed Truck Rack",316.46,578.00,433.50,,,,,0,0,0,,,possible,"No Fee",27.00
Access,Access,acc4000964,4000964,"Access ADARAC Aluminum Pro Series 04+ Ford F-150 (Excl Heritage Model) 5ft 6in Bed Truck Rack",316.46,578.00,433.50,,,,,0,0,0,,,possible,"No Fee",26.00
Access,Access,acc4000965,4000965,"Access ADARAC Aluminum Pro Series 09+ Dodge Ram 1500 5ft 7in Bed (w/o RamBox) Truck Rack",316.46,578.00,433.50,,,,,0,0,0,,,possible,"No Fee",26.00
Access,Access,acc4000966,4000966,"Access ADARAC Aluminum Pro Series 08-16 Ford Super Duty F-250/F-350 (Incl Dually) 8ft Bed Truck Rack",327.95,599.00,449.25,,,,,0,0,0,,,possible,"No Fee",33.00
Access,Access,acc4001014,4001014,"Access ADARAC Aluminum Pro Series 04-13 Chevy/GMC Full Size 1500 5ft 8in Bed Truck Rack",316.46,578.00,433.50,,,,,0,0,0,,,possible,"No Fee",27.00
Access,Access,acc4001015,4001015,"Access ADARAC Aluminum Pro Series 99-13 Chevy/GMC Full Size 1500 6ft 6in Bed Truck Rack",316.46,578.00,433.50,,,,,0,0,0,,,possible,"No Fee",28.00
Access,Access,acc4001016,4001016,"Access ADARAC Aluminum Pro Series 01-14 Chevy/GMC Full Size 2500/3500 6ft 6in Bed Truck Rack",316.46,578.00,433.50,,,,,0,0,0,,,possible,"No Fee",28.00
Access,Access,acc4000882,4000882,"Access ADARAC Tie Down Kit - Set of 4",8.19,14.96,11.22,,,,,2,0,2,,,possible,"No Fee",0.50
Access,Access,acc4000880,4000880,"Access ADARAC Load Divider Kit - Set of 2",10.93,19.96,14.97,,,,,0,0,0,,,possible,"No Fee",1.00
Access,Access,accB1050019,B1050019,"Access LOMAX Tri-Fold Cover 16-19 Toyota Tacoma (Excl OEM Hard Covers) - 5ft Short Bed",568.85,"1,039.00",779.25,,883.15,,,0,0,0,,,possible,"No Fee",57.00
Access,Access,accB1050029,B1050029,"Access LOMAX Tri-Fold Cover 16-19 Toyota Tacoma (Excl OEM Hard Covers) - 6ft Standard Bed",614.30,"1,122.00",841.50,,953.70,,,1,0,1,,,possible,"No Fee",67.00
Access,Access,accB1050059,B1050059,"Access LOMAX Tri-Fold Cover 07-19 Toyota Tundra - 5ft 6in Bed (w/ Deck Rail) - Matte Black",568.85,"1,039.00",779.25,,883.15,,,0,0,0,,,possible,"No Fee",70.00
Access,Access,accB1050069,B1050069,"Access LOMAX Tri-Fold Cover 07-19 Toyota Tundra  - 6ft 6in Bed (w/ Deck Rail) - Matte Black",614.30,"1,122.00",841.50,,953.70,,,0,0,0,,,possible,"No Fee",77.00
Access,Access,accB10500591,B10500591,"Access LOMAX Professional Series Tri-Fold Cover 2007+ Toyota Tundra - 5ft 6in (w/ Deck Rail)",654.26,"1,195.00",896.25,,"1,015.75",,,1,0,1,,,possible,"No Fee",77.00
Access,Access,accA1010071,A1010071,"Access Rockstar 17-19 Ford F-250/F-350 Smooth Mill Finish Hitch Mounted Mud Flaps",212.98,389.00,291.75,,330.65,,,0,0,0,,,possible,"No Fee",45.00
Access,Access,accA10100711,A10100711,"Access Rockstar XL 17-19 Ford F-250/F-350 Hitch Mounted Mud Flaps",262.25,479.00,359.25,,,,,0,0,0,,,possible,"No Fee",45.00
Access,Access,accA10100712,A10100712,"Access Rockstar 2XL 17-19 Ford F-250/F-350 Smooth Mill Hitch Mounted Mud Flaps",278.68,509.00,381.75,,432.65,,,0,0,0,,,possible,"No Fee",45.00
Access,Access,accA10100713,A10100713,"Access Rockstar 3XL 17-19 Ford F-250/F-350 Smooth Mill Hitch Mounted Mud Flaps",295.10,539.00,404.25,,,,,0,0,0,,,possible,"No Fee",45.00
Access,Access,accA1010072,A1010072,"Access Rockstar 17-19 Ford F-250/F-350 Diamond Plate Finish Hitch Mounted Mud Flaps",234.88,429.00,321.75,,,,,0,0,0,,,possible,"No Fee",45.00
Access,Access,accA10100721,A10100721,"Access Rockstar XL 17-19 Ford F-250/F-350 Diamond Plate Finish Hitch Mounted Mud Flaps",284.15,519.00,389.25,,,,,0,0,0,,,possible,"No Fee",48.00
Access,Access,accA10100722,A10100722,"Access Rockstar 2XL 17-19 Ford F-250/F-350 Diamond Plate Finish Hitch Mounted Mud Flaps",300.58,549.00,411.75,,,,,0,0,0,,,possible,"No Fee",54.00
Access,Access,accA10100723,A10100723,"Access Rockstar 3XL 17-19 Ford F-250/F-350 Diamond Plate Finish Hitch Mounted Mud Flaps",317.00,579.00,434.25,,,,,0,0,0,,,possible,"No Fee",61.00
Access,Access,accA1010081,A1010081,"Access Rockstar 17-19 Ford F-250/F-350 Smooth Mill Finish Hitch Mounted Trim To Fit Mud Flaps",212.98,389.00,291.75,,,,,0,0,0,,,possible,"No Fee",45.00
Access,Access,accA10100811,A10100811,"Access Rockstar XL 17-19 Ford F-250/F-350 Smooth Mill Finish Hitch Mounted Trim To Fit Mud Flaps",262.25,479.00,359.25,,,,,0,0,0,,,possible,"No Fee",48.00
Access,Access,accA10100812,A10100812,"Access Rockstar 2XL 17-19 Ford F-250/F-350 Smooth Mill Finish Hitch Mounted Trim To Fit Mud Flaps",278.68,509.00,381.75,,,,,0,0,0,,,possible,"No Fee",54.00
Access,Access,accA1010082,A1010082,"Access Rockstar 17-19 Ford F-250/F-350 Diamond Plate Finish Hitch Mounted Trim To Fit Mud Flaps",234.88,429.00,321.75,,,,,0,0,0,,,possible,"No Fee",45.00
Access,Access,accA10100821,A10100821,"Access Rockstar XL 17-19 Ford F-250/F-350 Diamond Plate Finish Hitch Mounted Trim To Fit Mud Flaps",284.15,519.00,389.25,,,,,0,0,0,,,possible,"No Fee",48.00
Access,Access,accA10100822,A10100822,"Access Rockstar 2XL 17-19 Ford F-250/F-350 Diamond Plate Finish Hitch Mounted Trim To Fit Mud Flaps",300.58,549.00,411.75,,,,,0,0,0,,,possible,"No Fee",54.00
Access,Access,acc4001219,4001219,"Access ADARAC Aluminum Series 02-19 Dodge Ram 1500 6ft 4in Bed (w/o RamBox) Truck Rack",316.46,578.00,433.50,,,,,0,0,0,,,possible,"No Fee",30.00
Access,Access,acc4001220,4001220,"Access ADARAC Aluminum Series 09+ Dodge Ram 1500 8ft Bed (w/o RamBox) Truck Rack",327.95,599.00,449.25,,,,,1,0,1,,,possible,"No Fee",35.00
Access,Access,acc4001221,4001221,"Access ADARAC Aluminum Series 97+ Ford F-150 6ft 6in Bed Truck Rack",316.46,578.00,433.50,,,,,1,0,1,,,possible,"No Fee",30.00
Access,Access,acc4001222,4001222,"Access ADARAC Aluminum Series 97+ Ford F-150 8ft Bed Truck Rack",327.95,599.00,449.25,,,,,1,0,1,,,possible,"No Fee",35.00
Access,Access,acc4001223,4001223,"Access ADARAC Aluminum Series 14+ Chevy/GMC Full Size 1500 6ft 6in Bed Truck Rack",316.46,578.00,433.50,,,,,0,0,0,,,possible,"No Fee",52.00
Access,Access,acc4001224,4001224,"Access ADARAC Aluminum Series 14+ Chevy/GMC Full Size 1500 8ft Bed Truck Rack",327.95,599.00,449.25,,,,,0,0,0,,,possible,"No Fee",45.00
Access,Access,acc4001225,4001225,"Access ADARAC Aluminum Series 15-19 Chevy/GMC Colorado/Canyon 5ft Bed Truck Rack",316.46,578.00,433.50,,,,,0,0,0,,,possible,"No Fee",37.00
Access,Access,acc4001226,4001226,"Access ADARAC Aluminum Series 15-19 Chevy/GMC Colorado/Canyon 6ft Bed Truck Rack",316.46,578.00,433.50,,,,,0,0,0,,,possible,"No Fee",39.00
Access,Access,acc4001227,4001227,"Access ADARAC Aluminum Series 17-19 Ford Super Duty F-250/F-350 6ft 8in Truck Rack",316.46,578.00,433.50,,,,,1,0,1,,,possible,"No Fee",35.00
Access,Access,acc4001228,4001228,"Access ADARAC Aluminum Series 08-16 Ford Super Duty F-250/F-350 6ft 8in Bed Truck Rack",316.46,578.00,433.50,,,,,1,0,1,,,possible,"No Fee",35.00
Access,Access,acc4001229,4001229,"Access ADARAC Aluminum Series 03+ Dodge Ram 2500/3500 6ft 4in Bed (w/o RamBox) Truck Rack",316.46,578.00,433.50,,,,,1,0,1,,,possible,"No Fee",51.00
Access,Access,acc4001230,4001230,"Access ADARAC Aluminum Series 10-19 Dodge Ram 2500/3500 8ft Bed (w/o RamBox) Truck Rack",327.95,599.00,449.25,,,,,1,0,1,,,possible,"No Fee",35.00
Access,Access,acc4001231,4001231,"Access ADARAC Aluminum Series 17-19 Ford Super Duty F-250/F-350 (Incl Dually) 8ft Bed Truck Rack",327.95,599.00,449.25,,,,,0,0,0,,,possible,"No Fee",45.00
Access,Access,acc4001232,4001232,"Access ADARAC Aluminum Series 15-19 Chevy/GMC 2500/3500 Full Size 6ft 6in Bed Truck Rack",316.46,578.00,433.50,,,,,1,0,1,,,possible,"No Fee",53.00
Access,Access,acc4001233,4001233,"Access ADARAC Aluminum Series 15-19 Chevy/GMC 2500/3500 Full Size 8ft Bed Truck Rack",327.95,599.00,449.25,,,,,1,0,1,,,possible,"No Fee",35.00
Access,Access,acc4001218,4001218,"Access ADARAC Aluminum Series 14+ Chevy/GMC Full Size 1500 5ft 8in Bed Truck Rack",316.46,578.00,433.50,,,,,0,0,0,,,possible,"No Fee",39.00
Access,Access,acc4001234,4001234,"Access ADARAC Aluminum Series 04+ Ford F-150 (Excl Heritage Model) 5ft 6in Bed Truck Rack",316.46,578.00,433.50,,,,,0,0,0,,,possible,"No Fee",39.00
Access,Access,acc4001235,4001235,"Access ADARAC Aluminum Series 09+ Dodge Ram 1500 5ft 7in Bed (w/o RamBox) Truck Rack",316.46,578.00,433.50,,,,,0,0,0,,,possible,"No Fee",38.00
Access,Access,acc4001236,4001236,"Access ADARAC Aluminum Series 08-16 Ford Super Duty F-250/F-350 (Incl Dually) 8ft Bed Truck Rack",327.95,599.00,449.25,,,,,1,0,1,,,possible,"No Fee",35.00
Access,Access,acc4001237,4001237,"Access ADARAC Aluminum Series 04-13 Chevy/GMC Full Size 1500 5ft 8in Bed Truck Rack",316.46,578.00,433.50,,,,,0,0,0,,,possible,"No Fee",39.00
Access,Access,acc4001238,4001238,"Access ADARAC Aluminum Series 99-13 Chevy/GMC Full Size 1500 6ft 6in Bed Truck Rack",316.46,578.00,433.50,,,,,1,0,1,,,possible,"No Fee",52.00
Access,Access,acc4001239,4001239,"Access ADARAC Aluminum Series 01-14 Chevy/GMC 2500/3500 Full Size 6ft 6in Bed Truck Rack",316.46,578.00,433.50,,,,,1,0,1,,,possible,"No Fee",51.00
Access,Access,acc25010399,25010399,"Access Truck Bed Mat 99+ Ford Ford Super Duty F-250 F-350 F-450 6ft 8in Bed",85.41,156.00,117.00,,,,,0,0,0,,,possible,"No Fee",7.00
Access,Access,acc25010409,25010409,"Access Truck Bed Mat 17-19 Ford Ford Super Duty F-250 F-350 F-450 8ft Bed (Includes Dually)",96.91,177.00,132.75,,,,,0,0,0,,,possible,"No Fee",7.00
Access,Access,acc4001592,4001592,"Access Rockstar ALL Accessories 2-1/2in Ball Mount Clamp w/ Hardware (ROXTER Only)",6.57,12.00,9.00,,,,,0,0,0,,,possible,"No Fee",1.25
Access,Access,acc4001591,4001591,"Access Rockstar ALL Accessories 2-1/2in Ball Mount Clamp w/ Hardware (ROCTECTION Only)",6.57,12.00,9.00,,,,,0,0,0,,,possible,"No Fee",1.00
Access,Access,acc4001677,4001677,"Access ADARAC 17-19 Toyota Tundra 5ft 6in Bed Truck Rack",261.71,478.00,358.50,,,,,0,0,0,,,possible,"No Fee",76.00
Access,Access,acc4001678,4001678,"Access ADARAC 2007-19 Toyota Tundra 6ft 6in Bed Truck Rack",261.71,478.00,358.50,,,,,0,0,0,,,possible,"No Fee",88.00
Access,Access,acc4001679,4001679,"Access ADARAC 2007-19 Toyota Tundra 8ft Bed Truck Rack",273.20,499.00,374.25,,,,,0,0,0,,,possible,"No Fee",103.00
Access,Access,acc4001656,4001656,"Access ADARAC Accessories Anchor Cleat Kit (for Mounting Channel Models) (Set of 2)",10.93,19.95,14.97,,,,,2,0,2,,,possible,"No Fee",0.50
Access,Access,acc4001666,4001666,"Access ADARAC Aluminum Pro Series 2007-19 Toyota Tundra 5ft 6in Bed Truck Rack",316.46,578.00,433.50,,,,,0,0,0,,,possible,"No Fee",36.00
Access,Access,acc4001671,4001671,"Access ADARAC Aluminum Pro Series 2007-19 Toyota Tundra 6ft 6in Bed Truck Rack",316.46,578.00,433.50,,,,,0,0,0,,,possible,"No Fee",20.00
Access,Access,acc4001676,4001676,"Access ADARAC Aluminum Pro Series 2007-19 Toyota Tundra 8ft Bed Truck Rack",327.95,599.00,449.25,,,,,0,0,0,,,possible,"No Fee",35.00
Access,Access,acc4001665,4001665,"Access ADARAC Aluminum Series 2007-19 Toyota Tundra 5ft 6in Bed Truck Rack",316.46,578.00,433.50,,,,,0,0,0,,,possible,"No Fee",39.00
Access,Access,acc4001670,4001670,"Access ADARAC Aluminum Series 2007-19 Toyota Tundra 6ft 6in Bed Truck Rack",316.46,578.00,433.50,,,,,0,0,0,,,possible,"No Fee",20.00
Access,Access,acc4001675,4001675,"Access ADARAC Aluminum Series 2007-19 Toyota Tundra 8ft Bed Truck Rack",327.95,599.00,449.25,,,,,1,0,1,,,possible,"No Fee",35.00
Access,Access,acc4001023,4001023,"Access Replacement Strike w/ Embedded Bolt (for LIMITED / ORIGINAL / LORADO / TOOLBOX / LITERIDER)",6.26,11.44,8.58,,,,,0,0,0,,,possible,"No Fee",1.00
Access,Access,accB1040039,B1040039,"Access LOMAX Tri-Fold 2019+ Dodge Ram 1500 5ft 7in Short Bed",568.85,"1,039.00",779.25,,883.15,,,3,3,7,,,possible,"No Fee",67.00
Access,Access,accB1040049,B1040049,"Access LOMAX Tri-Fold Cover 2019+ Ram 1500 6ft 4in Box Standard Bed",614.30,"1,122.00",841.50,,953.70,,,3,1,5,,,possible,"No Fee",74.00
Access,Access,acc60270,60270,"Access Slide In Hook Replacement Kit - Vanish and Tonnosport - 1in x 17ft w/ 4 Screws",16.43,30.00,22.50,,25.50,,,0,0,0,,,possible,"No Fee",0.50
Access,Access,acc25040239,25040239,"Access Truck Bed Mat 2019+ Ram 1500 5ft 7in Box",85.41,156.00,117.00,,132.60,,,0,0,0,,,possible,"No Fee",5.00
Access,Access,accB0040039,B0040039,"Access LOMAX Professional Series Tri-Fold Cover 2019+ Ram 1500 5ft 7in Short Bed (w/o Ram Box)",654.26,"1,195.00",896.25,,"1,015.75",,,1,0,1,,,possible,"No Fee",75.00
Access,Access,accB0040049,B0040049,"Access LOMAX Professional Series Tri-Fold Cover 2019+ Ram 1500 6ft 4in Box Standard Bed (w/o RamBox)",699.70,"1,278.00",958.50,,"1,086.30",,,2,0,2,,,possible,"No Fee",74.00
Access,Access,acc94239,94239,"Access Vanish 19+ Dodge Ram 1500 5ft 7in Bed Roll-Up Cover",260.06,475.00,356.25,,,,,0,0,0,,,possible,"No Fee",32.00
Access,Access,accB0010019,B0010019,"Access LOMAX Professional Series Tri-Fold Cover 04-18 Ford F-150 5ft 6in Short Bed Diamond Plate",654.26,"1,195.00",896.25,,"1,015.75",,,2,0,2,,,possible,"No Fee",66.00
Access,Access,acc14239,14239,"Access Original 2019+ Dodge/Ram 1500 5ft 7in Bed Roll-Up Cover",315.91,577.00,432.75,,490.45,,,0,0,0,,,possible,"No Fee",34.00
Access,Access,acc14249,14249,"Access Original 2019+ Dodge/Ram 1500 6ft 4in Bed Roll-Up Cover",315.91,577.00,432.75,,490.45,,,0,0,0,,,possible,"No Fee",36.00
Access,Access,acc22040239,22040239,"Access Tonnosport 2019+ Dodge/Ram 1500 5ft 7in Bed Roll-Up Cover",226.12,413.00,309.75,,,,,0,0,0,,,possible,"No Fee",34.00
Access,Access,acc22040249,22040249,"Access Tonnosport 2019+ Dodge/Ram 1500 6ft 4in Bed Roll-Up Cover",226.12,413.00,309.75,,,,,0,0,0,,,possible,"No Fee",27.00
Access,Access,acc24239,24239,"Access Limited 2019+ Dodge/Ram 1500 5ft 7in Bed Roll-Up Cover",354.78,648.00,486.00,,550.80,,,0,0,0,,,possible,"No Fee",34.00
Access,Access,acc24249,24249,"Access Limited 2019+ Dodge/Ram 1500 6ft 4in Bed Roll-Up Cover",354.78,648.00,486.00,,550.80,,,0,0,0,,,possible,"No Fee",37.00