IsNotCarbApproved,ClearanceItem,PrimaryVendor,PricingGroup,InternalPartNumber,PartNumber,Barcode,ProductName,Description,Width,Height,Length,Weight,ProductDepartment,Cost,PromoPrice,PromoEndDate,PromoShipping,PromoShipMethod,PromoShipEndDate,Retail,Jobber,CoreCharge,Map,Other,OtherName,EastStock,WestStock,CentralStock,Stock,MfrStock,MfrStockDate,DropShip,DSFee,OverMaximumLimits,ETA,ProductCategory
N,N,Access,"Access B",accC100001,C100001,,"ACC Rockstar Mud Flaps","Access Rockstar Roctection Universal (Fits Most P/Us & SUVs) 80in. Wide Hitch Mounted Mud Flaps",13.00,5.00,33.00,28.00,"Body Armor & Protection",150.66,150.66,,,,,279.00,209.25,,,,,0,0,0,0,,,possible,"No Fee",N,,"Mud Flaps"
N,N,Access,Access,accB1010049,B1010049,813072022654,"ACC LOMAX Tri-Fold Cover","Access LOMAX Tri-Fold Cover 17-19 Ford Super Duty F-250/F-350/F-450 - 6ft 8in Standard Bed",35.90,7.50,71.00,65.00,"Tonneau Covers",605.88,605.88,,,,,1122.00,841.50,,953.70,,,0,1,0,1,,,possible,"No Fee",N,2020-10-07,"Bed Covers - Folding"
N,N,Access,Access,accB1040029,B1040029,813072022562,"ACC LOMAX Tri-Fold Cover","Access LOMAX Tri-Fold Cover 02-19 Dodge Ram 6Ft./4in. Bed (w/o Rambox Cargo Management System)",35.60,7.60,71.00,72.00,"Tonneau Covers",605.88,605.88,,,,,1122.00,841.50,,953.70,,,0,0,0,0,,,possible,"No Fee",N,2020-10-07,"Bed Covers - Folding"
N,N,Access,Access,accB1010029,B1010029,813072022555,"ACC LOMAX Tri-Fold Cover","Access LOMAX Tri-Fold Cover 04-19 Ford F-150 - 6ft 6in Standard Bed",31.00,7.00,72.00,65.00,"Tonneau Covers",605.88,605.88,,,,,1122.00,841.50,,953.70,,,3,0,0,3,,,possible,"No Fee",N,2020-12-02,"Bed Covers - Folding"
N,Y,Access,Access,acc13239,13239,813072022579,"ACC Tonnosport Roll-Up Cover","Access Original 2017 Titan XD 8ft Bed (Clamps On w/ or w/o Utili-Track) Roll-Up Cover",8.60,5.00,98.50,39.00,"Tonneau Covers",323.46,135.85,2099-08-18,,,,599.00,449.25,,509.15,,,1,2,0,3,,,possible,"No Fee",N,,"Bed Covers - Roll Up"
N,Y,Access,Access,acc23239,23239,813072022586,"ACC Limited Roll-Up Cover","Access Limited 17-19 Titan XD 8ft Bed (Clamps On w/ or w/o Utili-Track) Roll-Up Cover",8.50,5.00,98.50,42.00,"Tonneau Covers",360.72,151.5,2099-08-18,,,,668.00,501.00,,567.80,,,1,2,0,3,,,possible,"No Fee",N,,"Bed Covers - Roll Up"
N,Y,Access,"Access B",acc33239,33239,813072022609,"ACC Literider Roll-Up Cover","Access Literider 17 Titan XD 8ft Bed (Clamps On w/ or w/o Utili-Track) Roll-Up Cover",8.50,5.00,98.50,38.00,"Tonneau Covers",273.24,114.76,2099-08-18,,,,506.00,379.50,,,,,0,2,0,2,,,possible,"No Fee",N,,"Bed Covers - Roll Up"
N,N,Access,Access,acc43239,43239,813072022616,"ACC Lorado Roll-Up Cover","Access Lorado 17 Titan XD 8ft Bed (Clamps On w/ or w/o Utili-Track) Roll-Up Cover",9.00,5.00,98.00,41.00,"Tonneau Covers",323.46,323.46,,,,,599.00,449.25,,509.15,,,0,0,0,0,,,possible,"No Fee",N,,"Bed Covers - Roll Up"
N,Y,Access,"Access B",acc22030239,22030239,813072022630,"ACC Tonnosport Roll-Up Cover","Access Tonnosport 17-19 Titan XD 8ft Bed (Clamps On w/ or w/o Utili-Track) Roll-Up Cover",8.60,5.10,98.50,33.00,"Tonneau Covers",233.82,187.06,2099-08-18,,,,433.00,324.75,,,,,0,1,0,1,,,possible,"No Fee",N,,"Bed Covers - Roll Up"
N,N,Access,"Access B",acc93239,93239,813072022623,"ACC Vanish Roll-Up Cover","Access Vanish 17 Titan XD 8ft Bed (Clamps On w/ or w/o Utili-Track) Roll-Up Cover",8.50,5.00,98.50,34.00,"Tonneau Covers",267.84,267.84,,,,,496.00,372.00,,,,,0,0,0,0,,,possible,"No Fee",N,,"Bed Covers - Roll Up"
N,N,Access,"Access B",acc25030239,25030239,813072022647,"ACC Truck Bed Mats","Access Truck Bed Mat Titan/Titan XD 8ft Bed",11.00,11.00,65.00,7.00,"Truck Bed Liners",95.58,95.58,,,,,177.00,132.75,,,,,0,0,0,0,,,possible,"No Fee",N,,"Truck Bed Liner - Drop-In"
N,N,Access,"Access B",acc80273,80273,,"ACC Uncategorized","Access Replacement Quick Clip Storage Strap LITERIDER / TONNOSPORT Strap w/ Buckle & Tapping Screw",2.00,1.00,2.00,0.25,Uncategorized,0.81,0.81,,,,,1.50,1.13,,,,,0,0,0,0,,,possible,"No Fee",N,,Uncategorized
N,N,Access,"Access B",acc20832,20832,,"ACC Uncategorized","Access Slide Lock",4.00,4.00,4.00,6.00,Uncategorized,2.25,2.25,,,,,4.16,3.12,,,,,0,0,0,0,,,possible,"No Fee",N,,Uncategorized
N,N,Access,Access,acc16039,16039,813072021923,"ACC Tonnosport Roll-Up Cover","Access Original 17-19 Honda Ridgeline 5ft Bed Roll-Up Cover",9.00,5.00,80.00,32.00,"Tonneau Covers",311.58,311.58,,,,,577.00,432.75,,490.45,,,1,0,0,1,,,possible,"No Fee",N,,"Bed Covers - Roll Up"
N,N,Access,"Access B",acc4000263,4000263,813072022906,"ACC Rockstar Accessories","Access Rockstar Anti-Rattle Clamp",6.00,2.00,9.00,2.00,"Trailer Hitches",8.07,8.07,,,,,14.95,11.21,,,,,0,0,0,0,,,possible,"No Fee",N,,"Hitch Accessories"
N,N,Access,"Access B",acc4000507,4000507,813072022913,"ACC Rockstar Accessories","Access Rockstar ALL Rubber Strips w Hardware (Set Of Two)",16.00,2.00,30.00,9.00,"Trailer Hitches",32.39,32.39,,,,,59.99,44.99,,,,,0,0,0,0,,,possible,"No Fee",N,,"Hitch Accessories"
N,N,Access,"Access B",acc90921,90921,813072021909,"ACC Rockstar Accessories","Access Rockstar ALL Accessories Extended Shaft - 2in & 2-5/16in Drop Ball Hitch for 2-1/2in Receiver",13.00,4.00,18.00,38.00,"Trailer Hitches",118.77,118.77,,,,,219.95,164.96,,,,,0,0,0,0,,,possible,"No Fee",N,,"Hitch Accessories"
N,N,Access,"Access B",acc90923,90923,813072021916,"ACC Rockstar Accessories","Access Rockstar ALL Accessories Extended Shaft - 2in & 2-5/16in Drop Ball Hitch for 2in Receiver",13.00,4.00,18.00,31.80,"Trailer Hitches",110.67,110.67,,,,,204.95,153.71,,,,,0,0,0,0,,,possible,"No Fee",N,,"Hitch Accessories"
N,N,Access,Access,acc46039,46039,813072021961,"ACC Lorado Roll-Up Cover","Access Lorado 17-19 Honda Ridgeline 5ft Bed Roll-Up Cover",9.00,5.00,80.00,38.00,"Tonneau Covers",311.58,311.58,,,,,577.00,432.75,,490.45,,,0,0,0,0,,,possible,"No Fee",N,,"Bed Covers - Roll Up"
N,N,Access,"Access B",acc10164,10164,,"ACC Uncategorized","Access 1in Female End Side Squeeze Buckle",2.00,1.00,2.00,0.25,Uncategorized,0.81,0.81,,,,,1.50,1.13,,,,,0,0,0,0,,,possible,"No Fee",N,,Uncategorized
N,N,Access,"Access B",acc4000570,4000570,813072022951,"ACC Rockstar Mud Flaps","Access Rockstar Universal Splash Guard Mudflaps 12in Width / 24in Length",12.50,2.62,25.00,11.10,"Body Armor & Protection",48.06,48.06,,,,,89.00,66.75,,,,,0,0,0,0,,,possible,"No Fee",N,,"Mud Flaps"
N,N,Access,Access,accB1020049,B1020049,,"ACC LOMAX Tri-Fold Cover","Access LOMAX Tri-Fold Cover 15-19 Chevy Colorado/ 2015-19 GMC Canyon 6ft Bed",34.25,7.50,71.50,66.00,"Tonneau Covers",605.88,605.88,,,,,1122.00,841.50,,953.70,,,0,0,0,0,,,possible,"No Fee",N,,"Bed Covers - Folding"
N,N,Access,"Access B",acc20790,20790,,"ACC Uncategorized","Access Replacement Hook Tape Kit 1-1/2in x 17ft w/ 4 Screws",4.00,4.00,4.00,6.00,Uncategorized,15.12,15.12,,,,,28.00,21.00,,,,,0,0,0,0,,,possible,"No Fee",N,,Uncategorized
N,Y,Access,Access,acc13229,13229,813072022456,"ACC Original Roll-Up Cover","Access Original 17-19 Nissan Titan 5-1/2ft Bed (Clamps On w/ or w/o Utili-Track) Roll-Up Cover",9.00,5.00,79.00,34.00,"Tonneau Covers",311.58,155.79,2099-08-18,,,,577.00,432.75,,490.45,,,1,0,0,1,,,possible,"No Fee",N,,"Bed Covers - Roll Up"
N,N,Access,Access,acc23229,23229,813072022463,"ACC Limited Roll-Up Cover","Access Limited 17-19 NIssan Titan 5-1/2ft Bed (Clamps On w/ or w/o Utili-Track) Roll-Up Cover",9.00,5.00,80.00,38.00,"Tonneau Covers",349.92,349.92,,,,,648.00,486.00,,550.80,,,0,0,0,0,,,possible,"No Fee",N,,"Bed Covers - Roll Up"
N,N,Access,Access,acc43229,43229,813072022494,"ACC Lorado Roll-Up Cover","Access Lorado 17-19 Nissan Titan 5-1/2ft Bed (Clamps On w/ or w/o Utili-Track) Roll-Up Cover",9.00,5.00,80.00,38.00,"Tonneau Covers",311.58,311.58,,,,,577.00,432.75,,490.45,,,0,0,0,0,,,possible,"No Fee",N,,"Bed Covers - Roll Up"
N,N,Access,"Access B",acc33229,33229,813072022487,"ACC Literider Roll-Up Cover","Access Literider 17-19 NIssan Titan 5-1/2ft Bed (Clamps On w/ or w/o Utili-Track) Roll-Up Cover",9.00,5.00,80.00,35.00,"Tonneau Covers",262.44,262.44,,,,,486.00,364.50,,,,,0,0,0,0,,,possible,"No Fee",N,,"Bed Covers - Roll Up"
N,N,Access,"Access B",acc93229,93229,813072022500,"ACC Vanish Roll-Up Cover","Access Vanish 17-19 NIssan Titan 5-1/2ft Bed (Clamps On w/ or w/o Utili-Track) Roll-Up Cover",9.00,5.00,80.00,30.00,"Tonneau Covers",256.50,256.50,,,,,475.00,356.25,,,,,0,0,0,0,,,possible,"No Fee",N,,"Bed Covers - Roll Up"
N,N,Access,"Access B",acc22030229,22030229,813072022517,"ACC Tonnosport Roll-Up Cover","Access Tonnosport 17-19 NIssan Titan 5-1/2ft Bed (Clamps On w/ or w/o Utili-Track) Roll-Up Cover",9.00,5.00,80.00,31.00,"Tonneau Covers",223.02,223.02,,,,,413.00,309.75,,,,,0,0,0,0,,,possible,"No Fee",N,,"Bed Covers - Roll Up"
N,N,Access,"Access B",acc27010369,27010369,813072023002,"ACC Tailgate Protector","Access Tailgate Protector 15-17 Ford F150",22.00,3.00,63.00,24.10,"Exterior Styling",92.88,92.88,,,,,172.00,129.00,,,,,0,0,0,0,,,possible,"No Fee",N,,Tailgates
N,N,Access,"Access B",acc27010399,27010399,813072023019,"ACC Tailgate Protector","Access Tailgate Protector 17-19 Ford F-250/F-350/F-450 Super Duty",23.00,3.00,63.00,24.00,"Exterior Styling",92.88,92.88,,,,,172.00,129.00,,,,,0,0,0,0,,,possible,"No Fee",N,,Tailgates
N,N,Access,"Access B",acc30474,30474,,"ACC Uncategorized","Access Slide In Hook Replacement Kit 1-1/2in x 17 ft w/ 4 screws",11.00,1.00,14.00,1.00,Uncategorized,19.98,19.98,,,,,37.00,27.75,,,,,0,0,0,0,,,possible,"No Fee",N,,Uncategorized
N,N,Access,Access,acc11409,11409,813072022173,"ACC Original Roll-Up Cover","Access Original 17-20 Ford Super Duty F-250/F-350/F-450 8ft Box (Including Dually) Roll Up Cover",9.00,5.00,99.00,36.00,"Tonneau Covers",323.46,323.46,,,,,599.00,449.25,,509.15,,,0,0,0,0,,,possible,"No Fee",N,,"Bed Covers - Roll Up"
N,N,Access,Access,acc21409,21409,813072022180,"ACC Limited Roll-Up Cover","Access Limited 17-19 Ford Super Duty F-250/F-350/F-450 8ft Box (Includes Dually) Roll-Up Cover",5.00,3.00,98.00,38.00,"Tonneau Covers",360.72,360.72,,,,,668.00,501.00,,567.80,,,0,0,0,0,,,possible,"No Fee",N,,"Bed Covers - Roll Up"
N,N,Access,"Access B",acc31409,31409,813072022197,"ACC Literider Roll-Up Cover","Access Literider 17-19 Ford Super Duty F-250/F-350/F-450 8ft Box (Includes Dually) Roll-Up Cover",9.00,5.00,98.00,35.00,"Tonneau Covers",273.24,273.24,,,,,506.00,379.50,,,,,0,0,0,0,,,possible,"No Fee",N,,"Bed Covers - Roll Up"
N,N,Access,Access,acc61409,61409,813072022227,"ACC Toolbox Roll-Up Cover","Access Toolbox 17-19 Ford Super Duty F-250/F-350/F-450 8ft Box (Includes Dually) Roll-Up Cover",9.00,5.00,98.00,36.00,"Tonneau Covers",318.06,318.06,,,,,589.00,441.75,,500.65,,,0,0,0,0,,,possible,"No Fee",N,,"Bed Covers - Roll Up"
N,N,Access,"Access B",acc91409,91409,813072022234,"ACC Vanish Roll-Up Cover","Access Vanish 17-19 Ford Super Duty F-250/F-350/F-450 8ft Box (Includes Dually) Roll-Up Cover",9.00,5.00,98.00,27.00,"Tonneau Covers",267.84,267.84,,,,,496.00,372.00,,,,,0,0,0,0,,,possible,"No Fee",N,,"Bed Covers - Roll Up"
N,N,Access,"Access B",acc22010409,22010409,813072022241,"ACC Tonnosport Roll-Up Cover","Access Tonnosport 17-19 Ford Super Duty F-250/F-350/F-450 8ft Box (Includes Dually) Roll-Up Cover",9.00,5.00,98.00,28.00,"Tonneau Covers",233.82,233.82,,,,,433.00,324.75,,,,,0,0,0,0,,,possible,"No Fee",N,,"Bed Covers - Roll Up"
N,N,Access,Access,accB1050039,B1050039,813072023026,"ACC LOMAX Tri-Fold Cover","Access LOMAX Tri-Fold Cover 07-17 Toyota Tundra  - 5ft 6in Bed (w/o Deck Rail)",33.00,8.00,70.00,66.00,"Tonneau Covers",561.06,561.06,,,,,1039.00,779.25,,883.15,,,0,0,0,0,,,possible,"No Fee",N,,"Bed Covers - Folding"
N,N,Access,Access,accB1050049,B1050049,813072023033,"ACC LOMAX Tri-Fold Cover","Access LOMAX Tri-Fold Cover 07-17 Toyota Tundra  - 6ft 6in Bed (w/o Deck Rail)",36.00,8.00,72.00,75.00,"Tonneau Covers",605.88,605.88,,,,,1122.00,841.50,,953.70,,,0,0,0,0,,,possible,"No Fee",N,,"Bed Covers - Folding"
N,N,Access,"Access B",acc10160,10160,,"ACC Uncategorized","Access Quick Release Storage Straps (2 Straps/Snap-On Brackets)",4.00,4.00,4.00,1.00,Uncategorized,9.55,9.55,,,,,17.68,13.26,,,,,0,0,0,0,,,possible,"No Fee",N,,Uncategorized
N,N,Access,Access,accB1010039,B1010039,813072022715,"ACC LOMAX Tri-Fold Cover","Access LOMAX Tri-Fold Cover 08-16 Ford Super Duty F-250/F-350/F-450 - 6ft 8in Standard Bed",31.50,8.00,71.00,75.00,"Tonneau Covers",605.88,605.88,,,,,1122.00,841.50,,953.70,,,0,0,0,0,,,possible,"No Fee",N,,"Bed Covers - Folding"
N,N,Access,"Access B",acc4000944,4000944,813072023101,"ACC ADARAC Truck Rack","Access ADARAC Aluminum Pro Series 02-19 Dodge Ram 1500 6ft 4in Bed (w/o RamBox) Truck Rack",8.50,5.00,80.00,23.00,"Roof Racks & Truck Racks",312.12,312.12,,,,,578.00,433.50,,,,,0,0,0,0,,,possible,"No Fee",N,,"Ladder Racks"
N,N,Access,"Access B",acc4000945,4000945,813072023118,"ACC ADARAC Truck Rack","Access ADARAC Aluminum Pro Series 09+ Dodge Ram 1500 8ft Bed (w/o RamBox) Truck Rack",8.00,5.00,101.00,33.00,"Roof Racks & Truck Racks",323.46,323.46,,,,,599.00,449.25,,,,,0,0,0,0,,,possible,"No Fee",N,,"Ladder Racks"
N,N,Access,"Access B",acc4000946,4000946,813072023125,"ACC ADARAC Truck Rack","Access ADARAC Aluminum Pro Series 97+ Ford F-150 6ft 6in Bed Truck Rack",9.00,8.50,84.00,36.00,"Roof Racks & Truck Racks",312.12,312.12,,,,,578.00,433.50,,,,,0,0,0,0,,,possible,"No Fee",N,2020-09-10,"Ladder Racks"
N,N,Access,"Access B",acc4000947,4000947,813072023132,"ACC ADARAC Truck Rack","Access ADARAC Aluminum Pro Series 97+ Ford F-150 8ft Bed Truck Rack",8.00,5.00,101.00,33.00,"Roof Racks & Truck Racks",323.46,323.46,,,,,599.00,449.25,,,,,0,0,0,0,,,possible,"No Fee",N,,"Ladder Racks"
N,N,Access,"Access B",acc4000948,4000948,813072023149,"ACC ADARAC Truck Rack","Access ADARAC Aluminum Pro Series 14+ Chevy/GMC Full Size 1500 6ft 6in Bed Truck Rack",8.50,5.00,80.00,28.00,"Roof Racks & Truck Racks",312.12,312.12,,,,,578.00,433.50,,,,,0,0,0,0,,,possible,"No Fee",N,,"Ladder Racks"
N,N,Access,"Access B",acc4000949,4000949,813072023156,"ACC ADARAC Truck Rack","Access ADARAC Aluminum Pro Series 14+ Chevy/GMC Full Size 1500 8ft Bed Truck Rack",8.00,5.00,101.00,33.00,"Roof Racks & Truck Racks",323.46,323.46,,,,,599.00,449.25,,,,,0,0,0,0,,,possible,"No Fee",N,,"Ladder Racks"
N,N,Access,"Access B",acc4000950,4000950,813072023163,"ACC ADARAC Truck Rack","Access ADARAC Aluminum Pro Series 15-19 Chevy/GMC Colorado/Canyon 5ft Bed Truck Rack",8.50,5.00,80.00,25.00,"Roof Racks & Truck Racks",312.12,312.12,,,,,578.00,433.50,,,,,0,0,0,0,,,possible,"No Fee",N,,"Ladder Racks"
N,N,Access,"Access B",acc4000951,4000951,813072023170,"ACC ADARAC Truck Rack","Access ADARAC Aluminum Pro Series 15-19 Chevy/GMC Colorado/Canyon 6ft Bed Truck Rack",8.50,5.00,80.00,27.00,"Roof Racks & Truck Racks",312.12,312.12,,,,,578.00,433.50,,,,,0,0,0,0,,,possible,"No Fee",N,,"Ladder Racks"
N,N,Access,"Access B",acc4000952,4000952,813072023187,"ACC ADARAC Truck Rack","Access ADARAC Aluminum Pro Series 17-19 Ford Super Duty F-250/F-350 6ft 8in Truck Rack",8.50,5.00,80.00,29.00,"Roof Racks & Truck Racks",312.12,312.12,,,,,578.00,433.50,,,,,0,0,0,0,,,possible,"No Fee",N,,"Ladder Racks"
N,N,Access,"Access B",acc4000955,4000955,813072023194,"ACC ADARAC Truck Rack","Access ADARAC Aluminum Pro Series 08-16 Ford Super Duty F-250/F-350 6ft 8in Bed Truck Rack",8.50,5.00,80.00,29.00,"Roof Racks & Truck Racks",312.12,312.12,,,,,578.00,433.50,,,,,0,0,0,0,,,possible,"No Fee",N,,"Ladder Racks"
N,N,Access,"Access B",acc4000956,4000956,813072023200,"ACC ADARAC Truck Rack","Access ADARAC Aluminum Pro Series 03+ Dodge Ram 2500/3500 6ft 4in Bed (w/o RamBox) Truck Rack",8.50,5.00,80.00,28.00,"Roof Racks & Truck Racks",312.12,312.12,,,,,578.00,433.50,,,,,0,0,0,0,,,possible,"No Fee",N,,"Ladder Racks"
N,N,Access,"Access B",acc4000957,4000957,813072023217,"ACC ADARAC Truck Rack","Access ADARAC Aluminum Pro Series 10-19 Dodge Ram 2500/3500 8ft Bed (w/o RamBox) Truck Rack",8.00,5.00,101.00,33.00,"Roof Racks & Truck Racks",323.46,323.46,,,,,599.00,449.25,,,,,0,0,0,0,,,possible,"No Fee",N,,"Ladder Racks"
N,N,Access,"Access B",acc4000958,4000958,813072023224,"ACC ADARAC Truck Rack","Access ADARAC Aluminum Pro Series 17-19 Ford Super Duty F-250/F-350 (Incl Dually) 8ft Bed Truck Rack",8.00,5.00,101.00,33.00,"Roof Racks & Truck Racks",323.46,323.46,,,,,599.00,449.25,,,,,0,0,0,0,,,possible,"No Fee",N,,"Ladder Racks"
N,N,Access,"Access B",acc4000959,4000959,813072023231,"ACC ADARAC Truck Rack","Access ADARAC Aluminum Pro Series 15-19 Chevy/GMC 2500/3500 Full Size 6ft 6in Bed Truck Rack",8.50,5.00,80.00,28.00,"Roof Racks & Truck Racks",312.12,312.12,,,,,578.00,433.50,,,,,0,0,0,0,,,possible,"No Fee",N,,"Ladder Racks"
N,N,Access,"Access B",acc4000960,4000960,813072023248,"ACC ADARAC Truck Rack","Access ADARAC Aluminum Pro Series 15-19 Chevy/GMC 2500/3500 Full Size 8ft Bed Truck Rack",8.00,5.00,101.00,33.00,"Roof Racks & Truck Racks",323.46,323.46,,,,,599.00,449.25,,,,,0,0,0,0,,,possible,"No Fee",N,,"Ladder Racks"
N,N,Access,"Access B",acc4000964,4000964,813072023262,"ACC ADARAC Truck Rack","Access ADARAC Aluminum Pro Series 04+ Ford F-150 (Excl Heritage Model) 5ft 6in Bed Truck Rack",8.50,5.00,80.00,26.00,"Roof Racks & Truck Racks",312.12,312.12,,,,,578.00,433.50,,,,,0,0,0,0,,,possible,"No Fee",N,,"Ladder Racks"
N,N,Access,"Access B",acc4000965,4000965,813072023279,"ACC ADARAC Truck Rack","Access ADARAC Aluminum Pro Series 09+ Dodge Ram 1500 5ft 7in Bed (w/o RamBox) Truck Rack",8.50,5.00,80.00,26.00,"Roof Racks & Truck Racks",312.12,312.12,,,,,578.00,433.50,,,,,0,0,0,0,,,possible,"No Fee",N,,"Ladder Racks"
N,N,Access,"Access B",acc4000966,4000966,813072023286,"ACC ADARAC Truck Rack","Access ADARAC Aluminum Pro Series 08-16 Ford Super Duty F-250/F-350 (Incl Dually) 8ft Bed Truck Rack",8.00,5.00,101.00,33.00,"Roof Racks & Truck Racks",323.46,323.46,,,,,599.00,449.25,,,,,0,0,0,0,,,possible,"No Fee",N,,"Ladder Racks"
N,N,Access,"Access B",acc4001014,4001014,813072023293,"ACC ADARAC Truck Rack","Access ADARAC Aluminum Pro Series 04-13 Chevy/GMC Full Size 1500 5ft 8in Bed Truck Rack",8.50,5.00,80.00,27.00,"Roof Racks & Truck Racks",312.12,312.12,,,,,578.00,433.50,,,,,0,0,0,0,,,possible,"No Fee",N,,"Ladder Racks"
N,N,Access,"Access B",acc4001015,4001015,813072023309,"ACC ADARAC Truck Rack","Access ADARAC Aluminum Pro Series 99-13 Chevy/GMC Full Size 1500 6ft 6in Bed Truck Rack",8.50,5.00,80.00,28.00,"Roof Racks & Truck Racks",312.12,312.12,,,,,578.00,433.50,,,,,0,0,0,0,,,possible,"No Fee",N,,"Ladder Racks"
N,N,Access,"Access B",acc4001016,4001016,813072023316,"ACC ADARAC Truck Rack","Access ADARAC Aluminum Pro Series 01-14 Chevy/GMC Full Size 2500/3500 6ft 6in Bed Truck Rack",8.50,5.00,80.00,28.00,"Roof Racks & Truck Racks",312.12,312.12,,,,,578.00,433.50,,,,,0,0,0,0,,,possible,"No Fee",N,,"Ladder Racks"
N,N,Access,"Access B",acc4000882,4000882,813072023071,"ACC Uncategorized","Access ADARAC Tie Down Kit - Set of 4",2.30,0.80,5.80,0.44,Uncategorized,8.08,8.08,,,,,14.96,11.22,,,,,0,0,0,0,,,possible,"No Fee",N,2020-09-04,Uncategorized
N,N,Access,"Access B",acc4000880,4000880,813072023064,"ACC Uncategorized","Access ADARAC Load Divider Kit - Set of 2",3.80,2.10,5.00,1.00,Uncategorized,10.78,10.78,,,,,19.96,14.97,,,,,0,0,0,0,,,possible,"No Fee",N,2020-09-04,Uncategorized
N,N,Access,Access,accB1050019,B1050019,813072022968,"ACC LOMAX Tri-Fold Cover","Access LOMAX Tri-Fold Cover 16-19 Toyota Tacoma (Excl OEM Hard Covers) - 5ft Short Bed",30.80,7.50,64.50,57.00,"Tonneau Covers",561.06,561.06,,,,,1039.00,779.25,,883.15,,,2,0,0,2,,,possible,"No Fee",N,2020-10-06,"Bed Covers - Folding"
N,N,Access,Access,accB1050029,B1050029,813072023088,"ACC LOMAX Tri-Fold Cover","Access LOMAX Tri-Fold Cover 16-19 Toyota Tacoma (Excl OEM Hard Covers) - 6ft Standard Bed",35.00,7.00,68.00,65.00,"Tonneau Covers",605.88,605.88,,,,,1122.00,841.50,,953.70,,,4,3,1,8,,,possible,"No Fee",N,2020-10-07,"Bed Covers - Folding"
N,N,Access,Access,accB1050059,B1050059,813072023569,"ACC LOMAX Tri-Fold Cover","Access LOMAX Tri-Fold Cover 07-19 Toyota Tundra - 5ft 6in Bed (w/ Deck Rail) - Matte Black",34.00,3.00,70.00,65.00,"Tonneau Covers",561.06,561.06,,,,,1039.00,779.25,,883.15,,,0,1,0,1,,,possible,"No Fee",N,2020-09-10,"Bed Covers - Folding"
N,N,Access,Access,accB1050069,B1050069,813072023583,"ACC LOMAX Tri-Fold Cover","Access LOMAX Tri-Fold Cover 07-19 Toyota Tundra  - 6ft 6in Bed (w/ Deck Rail) - Matte Black",35.00,7.00,71.00,65.00,"Tonneau Covers",605.88,605.88,,,,,1122.00,841.50,,953.70,,,0,0,0,0,,,possible,"No Fee",N,,"Bed Covers - Folding"
N,Y,Access,Access,accB10500591,B10500591,813072023576,"ACC LOMAX Tri-Fold Cover","Access LOMAX Professional Series Tri-Fold Cover 2007+ Toyota Tundra - 5ft 6in (w/ Deck Rail)",34.00,8.00,70.00,77.00,"Tonneau Covers",645.30,387.18,2099-08-18,,,,1195.00,896.25,,1015.75,,,1,0,0,1,,,possible,"No Fee",N,,"Bed Covers - Folding"
N,N,Access,Access,accA1010071,A1010071,813072022296,"ACC Rockstar Mud Flaps","Access Rockstar 17-19 Ford F-250/F-350 Smooth Mill Finish Hitch Mounted Mud Flaps",11.00,7.00,79.00,45.00,"Body Armor & Protection",210.06,210.06,,,,,389.00,291.75,,330.65,,,0,0,0,0,,,possible,"No Fee",N,,"Mud Flaps"
N,N,Access,"Access B",accA10100711,A10100711,813072022302,"ACC Rockstar Mud Flaps","Access Rockstar XL 17-19 Ford F-250/F-350 Hitch Mounted Mud Flaps",11.00,7.00,79.00,45.00,"Body Armor & Protection",258.66,258.66,,,,,479.00,359.25,,,,,0,0,0,0,,,possible,"No Fee",N,,"Mud Flaps"
N,N,Access,Access,accA10100712,A10100712,813072022319,"ACC Rockstar Mud Flaps","Access Rockstar 2XL 17-19 Ford F-250/F-350 Smooth Mill Hitch Mounted Mud Flaps",12.50,9.00,86.00,45.00,"Body Armor & Protection",274.86,274.86,,,,,509.00,381.75,,432.65,,,0,0,0,0,,,possible,"No Fee",N,,"Mud Flaps"
N,N,Access,"Access B",accA10100713,A10100713,813072022326,"ACC Rockstar Mud Flaps","Access Rockstar 3XL 17-19 Ford F-250/F-350 Smooth Mill Hitch Mounted Mud Flaps",12.50,9.00,86.00,45.00,"Body Armor & Protection",291.06,291.06,,,,,539.00,404.25,,,,,0,0,0,0,,,possible,"No Fee",N,,"Mud Flaps"
N,N,Access,"Access B",accA1010072,A1010072,813072022333,"ACC Rockstar Mud Flaps","Access Rockstar 17-19 Ford F-250/F-350 Diamond Plate Finish Hitch Mounted Mud Flaps",11.00,7.00,79.00,45.00,"Body Armor & Protection",231.66,231.66,,,,,429.00,321.75,,,,,0,0,0,0,,,possible,"No Fee",N,,"Mud Flaps"
N,N,Access,"Access B",accA10100721,A10100721,813072022340,"ACC Rockstar Mud Flaps","Access Rockstar XL 17-19 Ford F-250/F-350 Diamond Plate Finish Hitch Mounted Mud Flaps",11.00,7.00,79.00,48.00,"Body Armor & Protection",280.26,280.26,,,,,519.00,389.25,,,,,0,0,0,0,,,possible,"No Fee",N,,"Mud Flaps"
N,N,Access,"Access B",accA10100722,A10100722,813072022357,"ACC Rockstar Mud Flaps","Access Rockstar 2XL 17-19 Ford F-250/F-350 Diamond Plate Finish Hitch Mounted Mud Flaps",12.50,9.00,86.00,54.00,"Body Armor & Protection",296.46,296.46,,,,,549.00,411.75,,,,,0,0,0,0,,,possible,"No Fee",N,,"Mud Flaps"
N,N,Access,"Access B",accA10100723,A10100723,813072022364,"ACC Rockstar Mud Flaps","Access Rockstar 3XL 17-19 Ford F-250/F-350 Diamond Plate Finish Hitch Mounted Mud Flaps",12.50,9.00,86.00,61.00,"Body Armor & Protection",312.66,312.66,,,,,579.00,434.25,,,,,0,0,0,0,,,possible,"No Fee",N,,"Mud Flaps"
N,N,Access,"Access B",accA1010081,A1010081,813072022371,"ACC Rockstar Mud Flaps","Access Rockstar 17-19 Ford F-250/F-350 Smooth Mill Finish Hitch Mounted Trim To Fit Mud Flaps",11.00,7.00,79.00,45.00,"Body Armor & Protection",210.06,210.06,,,,,389.00,291.75,,,,,0,0,0,0,,,possible,"No Fee",N,,"Mud Flaps"
N,N,Access,"Access B",accA10100811,A10100811,813072022388,"ACC Rockstar Mud Flaps","Access Rockstar XL 17-19 Ford F-250/F-350 Smooth Mill Finish Hitch Mounted Trim To Fit Mud Flaps",11.00,7.00,79.00,48.00,"Body Armor & Protection",258.66,258.66,,,,,479.00,359.25,,,,,0,0,0,0,,,possible,"No Fee",N,,"Mud Flaps"